علف‌کش پس‌کاشت
scope note: علف‌کُش‍ی که از آن پس از مرحلۀ کاشت استفاده می‌شود.
broader: علف‌کش
preferred label: postplanting herbicide @en
type: Concept

علف‌کش
preferred label: herbicide @en
type: Concept
narrower: علف‌کش پس‌کاشت