علف‌کش
preferred label: herbicide @en
type: Concept
narrower: علف‌کش پیش‌کاشت

علف‌کش پیش‌کاشت
scope note: علف‌کُش‍ی که از آن پیش از مرحلۀ کاشت استفاده می‌شود.
broader: علف‌کش
preferred label: preplanting herbicide @en
type: Concept