هوای پخشیده
scope note: حباب‌های کوچک هوا که برای انتقال اکسیژن به مایع در زیر سطح آن تشکیل می‌شود.
broader: هوا
preferred label: diffused air @en
type: Concept

هوا
preferred label: air @en
type: Concept
narrower: هوای پخشیده