پلاستیک پودری
scope note: رزین یا پلاستیکی به‌صورت پودر بسیار ریز که در پوشانش بسترسیال و قالب‌گیری چرخشی و دیگر روش‌های تفجوشی به کار می‌رود.
related: تفجوشی
broader: پلاستیک
preferred label: powdered plastic @en
type: Concept

پلاستیک
preferred label: plastic @en
type: Concept
narrower: پلاستیک پودری

تفجوشی
preferred label: sintering @en
type: Concept
related: پلاستیک پودری