پودر کروی
preferred label: spherical powder @en
type: Concept
narrower: پودر گازافشاند

پودر گازافشاند
scope note: پودری کروی که براثر خروج گاز از یک افشانک و از هم ‌پاشیده شدن رشتۀ مذاب ایجاد می‌شود.
broader: پودر کروی
preferred label: gas atomized powder @en
type: Concept