محصول شکافت هسته‌ای
preferred label: fission product @en
type: Concept
narrower: شکافت‌پاره

شکافت‌پاره
scope note: هریک از محصولات اصلی فرایند شکافت که هسته‌های جدیدی با جِرم کوچک‌تر از هستۀ شکافته‌شده هستند.
broader: محصول شکافت هسته‌ای
preferred label: fission fragment @en
type: Concept