کشتی
preferred label: ship @en
type: Concept
related: طناب خودرها

طناب خودرها
alternative label: بافه خودرها
scope note: طنابی که رهاسازی آن بی‌نیاز از ملوان اسکله انجام می‌شود به‌نحوی‌که دو سر آن به موت‌ کشتی بسته می‌شود و تنها بخش میانی آن دور موت اسکله می‌پیچد یا از داخل حلقۀ آن عبور می‌کند.
related: کشتی
broader: طناب
preferred label: slip rope @en
type: Concept

طناب
preferred label: rope @en
type: Concept
narrower: طناب خودرها