لاستیک ولکانیده
alternative label: لاستیک پخت‌شده
scope note: محصول ولکانشی که در آن لاستیک در شرایط مشخص به‌صورت شیمیایی با گوگرد و شتاب‌دهنده‌ها واکنش می‌یابد تا دارای خواص فیزیکی مطلوب شود.
broader: لاستیک
preferred label: vulcanised rubber @en
type: Concept

لاستیک
preferred label: rubber @en
type: Concept
narrower: لاستیک ولکانیده