رسوب
preferred label: sediment @en
type: Concept
narrower: رسوب آب شیرین

رسوب آب شیرین
scope note: رسوبی که در محیط آب شیرین انباشته می‌شود.
broader: رسوب
preferred label: fresh water sediment @en
type: Concept