رسوب
preferred label: sediment @en
type: Concept
narrower: نهشته خشکی‌زاد

نهشته خشکی‌زاد
alternative label: رسوب خشکی‌زاد
scope note: رسوب دریایی کم‌عمقی که از فرسایش مواد سطح خشکی و انتقال آنها به دریا تشکیل شده است.
broader: رسوب
preferred label: terrigenous deposit @en
type: Concept