موم
scope note: 1. ماده‌ای محلول در حلاّل‌های چربی که گیاهان برای کاهش تعرق ترشح می‌کنند 2. ماده‌ای که زنبورعسل برای ساختن کندو ترشح می‌کند.
related: کاغذ مومی
broader: لیپید
preferred label: wax @en
type: Concept

لیپید
preferred label: lipid @en
type: Concept
narrower: موم

کاغذ مومی
preferred label: waxed paper @en
type: Concept
related: موم