توزین
preferred label: weighing @en
type: Concept
narrower: توزین بار

توزین بار
scope note: تعیین وزن بار وسیلۀ نقلیۀ ریلی ازطریق اندازه‌گیری بخشی از بار و برآورد وزن کل بار با استفاده از شیر توزین
broader: توزین
preferred label: load weighing @en
type: Concept