سفتی
preferred label: stiffness @en
type: Concept
narrower: سفتی گردشی

سفتی گردشی
scope note: میزان مطلق شیب نمودار نیروی جانبی در زاویه‌انحراف (slip angle) صفر
broader: سفتی
preferred label: cornering stiffness @en
type: Concept