کرنش زاویه‌ای
scope note: حالتی که در آن زاویۀ پیوند از مقدار معمول آن دور شده باشد.
broader: کرنش
preferred label: angle strain @en
type: Concept

کرنش
preferred label: strain @en
type: Concept
narrower: کرنش زاویه‌ای