کرنش برشی
scope note: تغییر شکل ناشی از جابه‌جایی صفحات موازی در جسم جامد
broader: کرنش
preferred label: shear strain @en
type: Concept

کرنش
preferred label: strain @en
type: Concept
narrower: کرنش برشی