اصطکاک شاره
scope note: مقاومت در برابر جریان شاره که از برهم‌کنش ذرات شاره و دیواره‌های مسیر پدید می‌آید.
broader: اصطکاک
preferred label: fluid friction @en
type: Concept

اصطکاک
preferred label: friction @en
type: Concept
narrower: اصطکاک شاره