پسار سرریز
scope note: اختلاف بین پسار در جریان هوای مبنا (datum flow) که برای ورود به موتور طراحی شده است و جریان هوای مازاد که از روی موتور عبور می‌کند.
broader: پسار
preferred label: spillage drag @en
type: Concept

پسار
preferred label: drag @en
type: Concept
narrower: پسار سرریز