پزشکی جنسی
scope note: مطالعه و تشخیص و درمان امور مربوط به سلامت جنسی زنان و مردان
broader: دانش پزشکی
preferred label: sexual medicine @en
type: Concept

دانش پزشکی
preferred label: medicine @en
type: Concept
narrower: پزشکی جنسی