ریخته‌گری پرفشار
scope note: یکی از روش‌های ریخته‌گری تحت فشار که مذاب با فشار زیاد و سرعت بسیار زیاد به درون قالب رانده می‌شود.
broader: ریخته‌گری تحت فشار
preferred label: high pressure die casting @en
type: Concept

ریخته‌گری تحت فشار
preferred label: pressure die casting @en
type: Concept
narrower: ریخته‌گری پرفشار