ریخته‌گری تحت فشار
preferred label: pressure die casting @en
type: Concept
narrower: ریخته‌گری کم‌فشار

ریخته‌گری کم‌فشار
scope note: یکی از روش‌های ریخته‌گری تحت فشار که در آن مذاب با فشار بسیار کم و به‌آرامی و معمولاً از کف وارد قالب می‌شود.
broader: ریخته‌گری تحت فشار
preferred label: low pressure die casting @en
type: Concept