ریخته‌گری تحت فشار
preferred label: pressure die casting @en
type: Concept
narrower: ریخته‌گری میان‌فشار

ریخته‌گری میان‌فشار
scope note: یکی از روش‌های ریخته‌گری نسبتاًً جدید که در آن فشار و سرعت در حدود 1 تا 2 اتمسفر حفظ می‌شود.
broader: ریخته‌گری تحت فشار
preferred label: medium pressure die casting @en
type: Concept