ویروس
preferred label: virus @en
type: Concept
narrower: ویروس یاورنیاز

ویروس یاورنیاز
scope note: ویروسی که اغلب از طریق جهش در طی تکثیر ویروس ایجاد می‌شود و فاقد عملکردهای ژن‌شناختی برای تکثیر است.
broader: ویروس
preferred label: satellite virus @en
type: Concept