بمباران منطقه‌ای
scope note: فروریختن پی‌درپی تعداد زیادی بمب در یک منطقه با محدوده مشخص، به‌طوری‌که به تمام قسمت‌ها صدمه وارد شود.
broader: بمباران
preferred label: carpet bombing @en
type: Concept

بمباران
preferred label: bombing @en
type: Concept
narrower: بمباران منطقه‌ای