پادکنش پدافند موشک پرتابشی مهمات فرعی
alternative label: پداموپ مهمات فرعی
scope note: نوعی پادکنش شامل فنون غلبه بر پدافند موشکی پرتابشی ازطریق کلاهک چندگانه‌ای که موشک در انتهای مسیر پرواز پراکنده می‌کند.
related: موشک هدایت‌شونده
broader: پادکنش
preferred label: submunition ballistic missile defence countermeasures @en
type: Concept

پادکنش
preferred label: countermeasures @en
type: Concept
narrower: پادکنش پدافند موشک پرتابشی مهمات فرعی

موشک هدایت‌شونده
preferred label: missile @en
type: Concept
related: پادکنش پدافند موشک پرتابشی مهمات فرعی