مولکول ایزوتوپی
scope note: مولکولی که شامل هسته‌ای با ایزوتوپ مشخص است.
broader: مولکول
preferred label: isotopic molecule @en
type: Concept

مولکول
preferred label: molecule @en
type: Concept
narrower: مولکول ایزوتوپی