پایشگری تابش
preferred label: radiation monitoring @en
type: Concept
broader: پایشگری

پایشگری ابر
preferred label: cloud monitoring @en
type: Concept
broader: پایشگری

پایشگری
scope note: عمل پاییدن و مشاهدۀ فعالیت‌ها در سامانۀ پردازشی به‌منظور تحلیل‌های بعدی
narrower: پایشگری تابش
narrower: پایشگری ابر
preferred label: monitoring (computer) @en
type: Concept