بالون رادیویی
preferred label: radio balloon @en
type: Concept
related: نجوم بالونی

نجوم بالونی
scope note: مطالعۀ اجرام آسمانی در لایه‌های بالای جوّ و آشکارسازی تابش الکترومغناطیسی در طولِ‌موج‌هایی که به سطح زمین نمی‌رسد، ازطریق تجهیزاتی که بر روی بالون نصب می‌شود.
related: بالون رادیویی
broader: نجوم
preferred label: balloon astronomy @en
type: Concept

نجوم
preferred label: astronomy @en
type: Concept
narrower: نجوم بالونی