نجوم نوترینو
scope note: رصد و مطالعۀ چشمه‌های نوترینوی خورشیدی و فراخورشیدی
broader: نجوم
preferred label: neutrino astronomy @en
type: Concept

نجوم
preferred label: astronomy @en
type: Concept
narrower: نجوم نوترینو