نجوم فرابنفش فرین
preferred label: extreme ultraviolet astronomy @en
type: Concept
broader: نجوم فرابنفش

نجوم
preferred label: astronomy @en
type: Concept
narrower: نجوم فرابنفش

نجوم فرابنفش
scope note: بخشی از علم نجوم که به مطالعۀ پرتوهای نجومی در بازۀ طیفی فرابنفش می‌پردازد.
narrower: نجوم فرابنفش فرین
broader: نجوم
preferred label: ultraviolet astronomy @en
type: Concept