نجوم
preferred label: astronomy @en
type: Concept
narrower: نجوم پرتوایکس

نجوم پرتوایکس
scope note: خشی از علم نجوم که به مطالعۀ پرتوِهای نجومی در بازۀ طیفی پرتوِ ایکس می‌پردازد.
broader: نجوم
preferred label: X-ray astronomy @en
type: Concept