هواشناسی پویایی‌شناختی
alternative label: هواشناسی دینامیکی
scope note: مطالعۀ حرکت‌های جوّ برای حل معادله‌های بنیادی آب‌پویایی‌شناسی یا سایر دستگاه‌های معادله‌های مربوط به حالت‌های ویژه، مانند نظریۀ آماری تلاطم
broader: هواشناسی
preferred label: dynamic meteorology @en
type: Concept

هواشناسی
preferred label: meteorology @en
type: Concept
narrower: هواشناسی پویایی‌شناختی