چراغ‌های ناوبری
scope note: چراغ‌هایی با نور قرمز در بال چپ و نور سبز یا آبی در بال راست و نور سفید روی دُم که در ساعات تاریکی جهت هواپیمای درحال‌حرکت را نشان می‌دهد.
related: هواگرد
broader: ناوبری
preferred label: navigation lights @en
type: Concept

ناوبری
preferred label: navigation @en
type: Concept
narrower: چراغ‌های ناوبری

هواگرد
preferred label: aircraft @en
type: Concept
related: چراغ‌های ناوبری