پوش‌رنگ باکتری‌کش
scope note: ماده‌ای پوششی با افزودنی‌های خاصی که مانع رشد باکتری بر سطح آن می‌شود.
broader: پوش‌رنگ
preferred label: bactericidal paint @en
type: Concept

پوش‌رنگ
preferred label: paint @en
type: Concept
narrower: پوش‌رنگ باکتری‌کش