پوش‌رنگ لعابی
scope note: مادۀ پوششی رنگ‌دانه‌دار و بر پایۀ پیوندۀ بسپاری که فیلم (film) حاصل از آن شبیه پوشش‌های معدنی است.
broader: پوش‌رنگ
preferred label: enamel paint @en
type: Concept

پوش‌رنگ
preferred label: paint @en
type: Concept
narrower: پوش‌رنگ لعابی