تصویرسنجی
preferred label: photogrammetry @en
type: Concept
narrower: تصویرسنجی معماری

تصویرسنجی معماری
scope note: شاخه‌ای از تصویرسنجی که به اندازه‌گیری و ارزیابی آثار معماری و میراث فرهنگی می‌پردازد.
broader: تصویرسنجی
preferred label: architectural photogrammetry @en
type: Concept