تصویرسنجی
preferred label: photogrammetry @en
type: Concept
narrower: تصویرسنجی صنعتی

تصویرسنجی صنعتی
scope note: شاخه‌ای از تصویرسنجی که به اندازه‌گیری دقیق و ارزیابی قطعات و سازه‌ها می‌پردازد.
broader: تصویرسنجی
preferred label: industrial photogrammetry @en
type: Concept