تصویرسنجی
preferred label: photogrammetry @en
type: Concept
narrower: تصویرسنجی پزشکی

تصویرسنجی پزشکی
scope note: شاخه‌ای از تصویرسنجی که به اندازه‌گیری و ارزیابی اندام‌های انسان و عوارض مربوط به آنها می‌پردازد.
broader: تصویرسنجی
preferred label: medical photogrammetry @en
type: Concept