تصویرسنجی
preferred label: photogrammetry @en
type: Concept
narrower: تصویرسنجی زمینی

تصویرسنجی زمینی
scope note: از روش‌های تصویرسنجی که در آن تصویربرداری از روی زمین انجام می‌شود.
broader: تصویرسنجی
preferred label: terrestrial photogrammetry @en
type: Concept