رهبندی الکتریکی
preferred label: electric impedance @en
type: Concept
narrower: رهبندی بهمنی

رهبندی بهمنی
scope note: رهبندی کاهش‌یافتۀ نقطۀ پیوند در هنگام شکست
broader: رهبندی الکتریکی
preferred label: avalanche impedance @en
type: Concept