رهبندی الکتریکی
preferred label: electric impedance @en
type: Concept
narrower: رهبندی مشخصه

رهبندی مشخصه
alternative label: رهبندی‌ خیزشی
scope note: نسبت ولتاژ به جریان در هر نقطه از خطِ انتقال که مقدار آن به مشخصات خط بستگی دارد.
broader: رهبندی الکتریکی
preferred label: characteristic impedance @en
type: Concept