رهبندی الکتریکی
preferred label: electric impedance @en
type: Concept
narrower: رهبندی‌های مزدوج

رهبندی‌های مزدوج
scope note: رهبندی‌هایی با مؤلفه‌های مقاومت برابر و مؤلفه‌های واکنایی برابر که علامت مختلف دارند.
broader: رهبندی الکتریکی
preferred label: conjugate impedances @en
type: Concept