رهبندی پای برج
scope note: رهبندی الکتریکی بین یک برج فولادی و زمین پیرامون آن
broader: رهبندی الکتریکی
preferred label: footing impedance @en
type: Concept

رهبندی الکتریکی
preferred label: electric impedance @en
type: Concept
narrower: رهبندی پای برج