رهبندی منفی
scope note: نوعی رهبندی که با افزایش جریان اُفت ولتاژ دو سر آن کاهش می‌یابد.
broader: رهبندی الکتریکی
preferred label: negative impedance @en
type: Concept

رهبندی الکتریکی
preferred label: electric impedance @en
type: Concept
narrower: رهبندی منفی