رهبندی نامی
scope note: وعی رهبندی که برای عملکرد در شرایط کار عادی طراحی شده است و معمولاً در بازۀ بسامد کاری قرار دارد.
broader: رهبندی الکتریکی
preferred label: nominal impedance @en
type: Concept

رهبندی الکتریکی
preferred label: electric impedance @en
type: Concept
narrower: رهبندی نامی