رهبندی الکتریکی
preferred label: electric impedance @en
type: Concept
narrower: رهبندی بهنجارشده

رهبندی بهنجارشده
scope note: رهبندی حاصل از تقسیم شدن رهبندی مشخصۀ یک خط انتقال یا موج‌بَر
broader: رهبندی الکتریکی
preferred label: ormalized impedance @en
type: Concept