رهبندی موازی
scope note: یکی از دو یا چند رهبندی که به یک جفت پایانه وصل می‌شود.
broader: رهبندی الکتریکی
preferred label: parallel impedance @en
type: Concept

رهبندی الکتریکی
preferred label: electric impedance @en
type: Concept
narrower: رهبندی موازی