سفتی مغناطیسی
scope note: حاصلِ‌ضرب شدت میدان مغناطیسی و شعاع انحنای مسیر برای ذرۀ باردار در میدان مغناطیسی
broader: ویژگی مغناطیسی
preferred label: magnetic stiffness @en
type: Concept

ویژگی مغناطیسی
preferred label: magnetic property @en
type: Concept
narrower: سفتی مغناطیسی