شاخص استاندارد آلودگی هوا
preferred label: pollutant standard index @en
type: Concept
related: آلاینده معیار

آلاینده معیار
scope note: هریک از آلاینده‌های عمده‌ای که در استانداردهای ملی و احیاناً بین‌المللیِ هوا برای سلامتی انسان مضر تلقی می‌شود.
related: شاخص استاندارد آلودگی هوا
broader: آلاینده
preferred label: criteria pollutant @en
type: Concept

آلاینده
preferred label: pollutant @en
type: Concept
narrower: آلاینده معیار