منبع نانقطه‌ای
scope note: آلودگی از یک منطقۀ گسترده و نه از نقطه‌ای معین
broader: منبع آلودگی
preferred label: non-point source @en
type: Concept

منبع آلودگی
preferred label: pollution source @en
type: Concept
narrower: منبع نانقطه‌ای