منبع آلودگی
preferred label: pollution source @en
type: Concept
narrower: منبع ثابت

منبع ثابت
scope note: ساختمان یا سازه یا تأسیساتی که در هوا آلاینده منتشر می‌کند یا ممکن است منتشر کند.
broader: منبع آلودگی
preferred label: stationary source @en
type: Concept